Go Back   Farm Town > Help & Support > Help & Support

Closed Thread
 
Thread Tools Search this Thread Display Modes
  #261  
Old Nov 29 2021, 08:11 PM
Alexm2012 Alexm2012 is offline
 
Join Date: Jun 28 2012
Posts: 202
Default

2021-11-30 01:50:18.762 ERRORRenderTexture.Create failed: requested size is too large.

2021-11-30 01:50:18.802 WARNCommandBuffer: temporary render texture _CameraColorTexture not found while executing (SetRenderTarget)
2021-11-30 01:50:19.082 WARNCommandBuffer: temporary render texture _CameraColorTexture not found while executing (SetGlobalTexture)
2021-11-30 01:50:19.109 WARNCommandBuffer: temporary render texture _CameraColorTexture not found while executing (Blit source)


trying to lay water and keep getting these errors in the FT console having to refresh and clear mem all done and browser is up to date
  #262  
Old Dec 29 2021, 06:35 AM
JNelson JNelson is offline
 
Join Date: May 12 2016
Posts: 380
Default

New accounts - female avatar when you click on the clothes its the male clothes , it doesnt fix and go back to correct female display until you hit enter to reload farm after finishing your initial avatar selections
  #263  
Old Jan 03 2022, 05:42 AM
JNelson JNelson is offline
 
Join Date: May 12 2016
Posts: 380
Default Neighbours Super Neighbours Design Together

for the past week I am having issues with players NOT getting my neighbor requests but i am getting theirs. THe most recent one , the player only has about 40 neighbors so avil space is not an issue, I been trying to SN them,,,, the other person it took several days week and about a dozen tries before she finally got it. The most recent one she cleared memcache, browser cache, checked games activity panel, closed reopen browser, even restated computer ,,,,,,,,,,, any ideas?

question part 2 -- is it normal that my SNs can access my purple hand but a hired friend hired to design can not? since i couldn't get them SN do to the other issue i tried to hire to design but my purple hand doesn't show up for them, just the green one

Quote:
Originally Posted by Tiger View Post
Hi JNelson,

Is the most recent one a very new Facebook account? There may be a delay with those. If it's not new, have her join the forum and provide her ID so that we can work with her.

In the meantime please have her look in her Facebook settings for Blocking and check if she has accidently blocked any app invites.
You might also want to try breaking the friend connection on Facebook then adding her back again, then both of you run memcache before trying the neighbour request again.
the most recent is a friend xtra account made in Nov, nothing blocked in setting will try the fr/un friend thing

the other one that 'finally' went thru she been playing for years

108450063288488 and 101047627588051 are trying to Sn 107523978430824 - friend request went thru fine , once again tried to neighbor again Jenny and Fisher are getting Franks request, but Frank is not getting theirs --- tried to hire for design without SNing and the purple hand is not coming up just the green ,, am out of ideas what could be the issue


MOD NOTES: Unable to reproduce the Neighbour requests issue or adding Neighbours as an SN.

Design Together is not showing the purple hand to be used to move items around but I am not sure if it should be showing up as you can't set the permission to use coins in design together so it might be right that it's disabled to prevent that.

Last edited by Tiger; Jan 03 2022 at 07:48 AM.
  #264  
Old Jan 04 2022, 10:07 PM
MikeYoung55 MikeYoung55 is offline
 
Join Date: Jul 21 2016
Location: Lisarow, NSW, Australia
Posts: 46
Default PlayerLoop called recursively

While I was ghosting my Fish Farm I accidentally clicked on the facility (after changing farms but before clicking on the green man) and got repeated errors. Log as follows:
2022-01-05 03:57:23.715 INFOCheckpoint-U-70 - Go To Farm - Mem: 129/78/208/369 MB
2022-01-05 03:57:23.722 INFOCheckpoint-U-72 - Load_Farm_Info - Mem: 129/78/208/369 MB
2022-01-05 03:57:24.497 INFOCheckpoint-U-74 - Load_Farm_Info Done - Mem: 129/77/206/369 MB
2022-01-05 03:57:24.505 INFOCheckpoint-U-75 - GoToFarmAsync - Mem: 129/77/206/369 MB
2022-01-05 03:57:24.518 INFOStats: WebGL 2.0 WebGL Mem: 206/369 MB Managed Mem: 129 MB Unity Mem: 77 MB Video Mem: 512 MB
2022-01-05 03:57:24.729 INFOCheckpoint-DONE - Map Loaded - Mem: 130/77/207/369 MB
------------------------------------
2022-01-05 03:57:40.614 INFOCheckpoint-U-70 - Go To Farm - Mem: 135/78/213/369 MB
2022-01-05 03:57:40.622 INFOCheckpoint-U-72 - Load_Farm_Info - Mem: 135/78/213/369 MB
2022-01-05 03:57:41.763 INFOCheckpoint-U-74 - Load_Farm_Info Done - Mem: 136/77/213/369 MB
2022-01-05 03:57:41.775 INFOCheckpoint-U-75 - GoToFarmAsync - Mem: 136/77/214/369 MB
2022-01-05 03:57:41.785 INFOStats: WebGL 2.0 WebGL Mem: 214/369 MB Managed Mem: 136 MB Unity Mem: 77 MB Video Mem: 512 MB
2022-01-05 03:57:41.912 INFOCheckpoint-DONE - Map Loaded - Mem: 138/77/215/369 MB
------------------------------------
2022-01-05 03:58:04.730 INFOCheckpoint-U-70 - Go To Farm - Mem: 144/78/222/369 MB
2022-01-05 03:58:04.738 INFOCheckpoint-U-72 - Load_Farm_Info - Mem: 144/78/222/369 MB
2022-01-05 03:58:05.664 INFOCheckpoint-U-74 - Load_Farm_Info Done - Mem: 145/77/222/369 MB
2022-01-05 03:58:05.674 INFOCheckpoint-U-75 - GoToFarmAsync - Mem: 145/77/223/369 MB
2022-01-05 03:58:05.686 INFOStats: WebGL 2.0 WebGL Mem: 223/369 MB Managed Mem: 145 MB Unity Mem: 77 MB Video Mem: 512 MB
2022-01-05 03:58:05.814 INFOCheckpoint-DONE - Map Loaded - Mem: 147/77/224/369 MB
------------------------------------
2022-01-05 03:58:07.447 ERRORexception thrown: RuntimeError: indirect call to null,@https://cdn.slashkey.com/flash/farm/main/1231-235959/Build/Build288.wasm.gz:wasm-function[34063]:0x9e2229
@https://cdn.slashkey.com/flash/farm/main/1231-235959/Build/Build288.wasm.gz:wasm-function[70333]:0x15f9277
@https://cdn.slashkey.com/flash/farm/main/1231-235959/Build/Build288.wasm.gz:wasm-function[2836]:0x120fb1
@https://cdn.slashkey.com/flash/farm/main/1231-235959/Build/Build288.wasm.gz:wasm-function[117640]:0x1fc2980
invoke_viiii@https://cdn.slashkey.co...ramework.js.gz:3:423847
@https://cdn.slashkey.com/flash/farm/main/1231-235959/Build/Build288.wasm.gz:wasm-function[34125]:0x9e6820
@https://cdn.slashkey.com/flash/farm/main/1231-235959/Build/Build288.wasm.gz:wasm-function[51715]:0xe49fe2
@https://cdn.slashkey.com/flash/farm/main/1231-235959/Build/Build288.wasm.gz:wasm-function[93198]:0x1a6fd3d
@https://cdn.slashkey.com/flash/farm/main/1231-235959/Build/Build288.wasm.gz:wasm-function[645]:0xcd59f
@https://cdn.slashkey.com/flash/farm/main/1231-235959/Build/Build288.wasm.gz:wasm-function[117640]:0x1fc2980
invoke_viiii@https://cdn.slashkey.co...ramework.js.gz:3:423847
@https://cdn.slashkey.com/flash/farm/main/1231-235959/Build/Build288.wasm.gz:wasm-function[93229]:0x1a71aeb
@https://cdn.slashkey.com/flash/farm/main/1231-235959/Build/Build288.wasm.gz:wasm-function[117640]:0x1fc2980
invoke_viiii@https://cdn.slashkey.co...ramework.js.gz:3:423847
@https://cdn.slashkey.com/flash/farm/main/1231-235959/Build/Build288.wasm.gz:wasm-function[45320]:0xcb515e
@https://cdn.slashkey.com/flash/farm/main/1231-235959/Build/Build288.wasm.gz:wasm-function[93231]:0x1a71f3e
@https://cdn.slashkey.com/flash/farm/main/1231-235959/Build/Build288.wasm.gz:wasm-function[133659]:0x24d93e4
@https://cdn.slashkey.com/flash/farm/main/1231-235959/Build/Build288.wasm.gz:wasm-function[19883]:0x57f03d
@https://cdn.slashkey.com/flash/farm/main/1231-235959/Build/Build288.wasm.gz:wasm-function[117649]:0x1fc2b1b
invoke_iiii@https://cdn.slashkey.com...ramework.js.gz:3:423665
@https://cdn.slashkey.com/flash/farm/main/1231-235959/Build/Build288.wasm.gz:wasm-function[3065]:0x1298ce
@https://cdn.slashkey.com/flash/farm/main/1231-235959/Build/Build288.wasm.gz:wasm-function[40813]:0xb77342
@https://cdn.slashkey.com/flash/farm/main/1231-235959/Build/Build288.wasm.gz:wasm-function[1180]:0xdde12
@https://cdn.slashkey.com/flash/farm/main/1231-235959/Build/Build288.wasm.gz:wasm-function[30512]:0x93541b
@https://cdn.slashkey.com/flash/farm/main/1231-235959/Build/Build288.wasm.gz:wasm-function[130321]:0x245f67b
@https://cdn.slashkey.com/flash/farm/main/1231-235959/Build/Build288.wasm.gz:wasm-function[57517]:0x11d0d5d
@https://cdn.slashkey.com/flash/farm/main/1231-235959/Build/Build288.wasm.gz:wasm-function[121709]:0x20aa889
@https://cdn.slashkey.com/flash/farm/main/1231-235959/Build/Build288.wasm.gz:wasm-function[60626]:0x1464bc9
@https://cdn.slashkey.com/flash/farm/main/1231-235959/Build/Build288.wasm.gz:wasm-function[60626]:0x1464c3a
@https://cdn.slashkey.com/flash/farm/main/1231-235959/Build/Build288.wasm.gz:wasm-function[56504]:0x1121951
@https://cdn.slashkey.com/flash/farm/main/1231-235959/Build/Build288.wasm.gz:wasm-function[117643]:0x1fc29ae
browserIterationFunc@https://cdn.sla...ramework.js.gz:3:221655
callUserCallback@https://cdn.slashke...ramework.js.gz:3:174853
runIter@https://cdn.slashkey.com/fla...ramework.js.gz:3:176129
Browser_mainLoop_runner@https://cdn....ramework.js.gz:3:174388
2022-01-05 03:58:07.455 ERROR{"isTrusted":true}
2022-01-05 03:58:07.463 LOGInvoking error handler due to
RuntimeError: indirect call to null
@https://cdn.slashkey.com/flash/farm/main/1231-235959/Build/Build288.wasm.gz:wasm-function[34063]:0x9e2229
@https://cdn.slashkey.com/flash/farm/main/1231-235959/Build/Build288.wasm.gz:wasm-function[70333]:0x15f9277
@https://cdn.slashkey.com/flash/farm/main/1231-235959/Build/Build288.wasm.gz:wasm-function[2836]:0x120fb1
@https://cdn.slashkey.com/flash/farm/main/1231-235959/Build/Build288.wasm.gz:wasm-function[117640]:0x1fc2980
invoke_viiii@https://cdn.slashkey.co...ramework.js.gz:3:423847
@https://cdn.slashkey.com/flash/farm/main/1231-235959/Build/Build288.wasm.gz:wasm-function[34125]:0x9e6820
@https://cdn.slashkey.com/flash/farm/main/1231-235959/Build/Build288.wasm.gz:wasm-function[51715]:0xe49fe2
@https://cdn.slashkey.com/flash/farm/main/1231-235959/Build/Build288.wasm.gz:wasm-function[93198]:0x1a6fd3d
@https://cdn.slashkey.com/flash/farm/main/1231-235959/Build/Build288.wasm.gz:wasm-function[645]:0xcd59f
@https://cdn.slashkey.com/flash/farm/main/1231-235959/Build/Build288.wasm.gz:wasm-function[117640]:0x1fc2980
invoke_viiii@https://cdn.slashkey.co...ramework.js.gz:3:423847
@https://cdn.slashkey.com/flash/farm/main/1231-235959/Build/Build288.wasm.gz:wasm-function[93229]:0x1a71aeb
@https://cdn.slashkey.com/flash/farm/main/1231-235959/Build/Build288.wasm.gz:wasm-function[117640]:0x1fc2980
invoke_viiii@https://cdn.slashkey.co...ramework.js.gz:3:423847
@https://cdn.slashkey.com/flash/farm/main/1231-235959/Build/Build288.wasm.gz:wasm-function[45320]:0xcb515e
@https://cdn.slashkey.com/flash/farm/main/1231-235959/Build/Build288.wasm.gz:wasm-function[93231]:0x1a71f3e
@https://cdn.slashkey.com/flash/farm/main/1231-235959/Build/Build288.wasm.gz:wasm-function[133659]:0x24d93e4
@https://cdn.slashkey.com/flash/farm/main/1231-235959/Build/Build288.wasm.gz:wasm-function[19883]:0x57f03d
@https://cdn.slashkey.com/flash/farm/main/1231-235959/Build/Build288.wasm.gz:wasm-function[117649]:0x1fc2b1b
invoke_iiii@https://cdn.slashkey.com...ramework.js.gz:3:423665
@https://cdn.slashkey.com/flash/farm/main/1231-235959/Build/Build288.wasm.gz:wasm-function[3065]:0x1298ce
@https://cdn.slashkey.com/flash/farm/main/1231-235959/Build/Build288.wasm.gz:wasm-function[40813]:0xb77342
@https://cdn.slashkey.com/flash/farm/main/1231-235959/Build/Build288.wasm.gz:wasm-function[1180]:0xdde12
@https://cdn.slashkey.com/flash/farm/main/1231-235959/Build/Build288.wasm.gz:wasm-function[30512]:0x93541b
@https://cdn.slashkey.com/flash/farm/main/1231-235959/Build/Build288.wasm.gz:wasm-function[130321]:0x245f67b
@https://cdn.slashkey.com/flash/farm/main/1231-235959/Build/Build288.wasm.gz:wasm-function[57517]:0x11d0d5d
@https://cdn.slashkey.com/flash/farm/main/1231-235959/Build/Build288.wasm.gz:wasm-function[121709]:0x20aa889
@https://cdn.slashkey.com/flash/farm/main/1231-235959/Build/Build288.wasm.gz:wasm-function[60626]:0x1464bc9
@https://cdn.slashkey.com/flash/farm/main/1231-235959/Build/Build288.wasm.gz:wasm-function[60626]:0x1464c3a
@https://cdn.slashkey.com/flash/farm/main/1231-235959/Build/Build288.wasm.gz:wasm-function[56504]:0x1121951
@https://cdn.slashkey.com/flash/farm/main/1231-235959/Build/Build288.wasm.gz:wasm-function[117643]:0x1fc29ae
browserIterationFunc@https://cdn.sla...ramework.js.gz:3:221655
callUserCallback@https://cdn.slashke...ramework.js.gz:3:174853
runIter@https://cdn.slashkey.com/fla...ramework.js.gz:3:176129
Browser_mainLoop_runner@https://cdn....ramework.js.gz:3:174388
2022-01-05 03:58:15.419 ERRORAn abnormal situation has occurred: the PlayerLoop internal function has been called recursively. Please contact Customer Support with a sample project so that we can reproduce the problem and troubleshoot it.
2022-01-05 03:58:16.430 ERRORAn abnormal situation has occurred: the PlayerLoop internal function has been called recursively. Please contact Customer Support with a sample project so that we can reproduce the problem and troubleshoot it.
2022-01-05 03:58:17.442 ERRORAn abnormal situation has occurred: the PlayerLoop internal function has been called recursively. Please contact Customer Support with a sample project so that we can reproduce the problem and troubleshoot it.
2022-01-05 03:58:18.453 ERRORAn abnormal situation has occurred: the PlayerLoop internal function has been called recursively. Please contact Customer Support with a sample project so that we can reproduce the problem and troubleshoot it.
2022-01-05 03:58:19.463 ERRORAn abnormal situation has occurred: the PlayerLoop internal function has been called recursively. Please contact Customer Support with a sample project so that we can reproduce the problem and troubleshoot it.

The last message just kept being repeated endlessly - copied entire console log (ctrl-A, ctrl-C) and extracted the relevant part.
__________________
Mike
User: 1278858024
  #265  
Old Jan 07 2022, 09:47 AM
Alexm2012 Alexm2012 is offline
 
Join Date: Jun 28 2012
Posts: 202
Default

2022-01-07 15:45:35.442 ERRORexception thrown: RuntimeError: null function or function signature mismatch,RuntimeError: null function or function signature mismatch
at https://cdn.slashkey.com/flash/farm/...:wasm-function[23464]:0x62225b
at https://cdn.slashkey.com/flash/farm/...:wasm-function[82664]:0x18704a7
at https://cdn.slashkey.com/flash/farm/...:wasm-function[133659]:0x24d93e4
at https://cdn.slashkey.com/flash/farm/...:wasm-function[19883]:0x57f03d
at https://cdn.slashkey.com/flash/farm/...:wasm-function[117649]:0x1fc2b1b
at invoke_iiii (https://cdn.slashkey.com/flash/farm/...js.gz:3:423665)
at https://cdn.slashkey.com/flash/farm/...:wasm-function[3065]:0x1298ce
at https://cdn.slashkey.com/flash/farm/...:wasm-function[40813]:0xb77342
at https://cdn.slashkey.com/flash/farm/...:wasm-function[1180]:0xdde12
at https://cdn.slashkey.com/flash/farm/...:wasm-function[30512]:0x93541b
at https://cdn.slashkey.com/flash/farm/...:wasm-function[130321]:0x245f67b
at https://cdn.slashkey.com/flash/farm/...:wasm-function[57517]:0x11d0d5d
at https://cdn.slashkey.com/flash/farm/...:wasm-function[121709]:0x20aa889
at https://cdn.slashkey.com/flash/farm/...:wasm-function[60626]:0x1464bc9
at https://cdn.slashkey.com/flash/farm/...:wasm-function[60626]:0x1464c3a
at https://cdn.slashkey.com/flash/farm/...:wasm-function[56504]:0x1121951
at https://cdn.slashkey.com/flash/farm/...:wasm-function[117643]:0x1fc29ae
at browserIterationFunc (https://cdn.slashkey.com/flash/farm/...js.gz:3:221655)
at callUserCallback (https://cdn.slashkey.com/flash/farm/...js.gz:3:174853)
at Object.runIter (https://cdn.slashkey.com/flash/farm/...js.gz:3:176113)
at Browser_mainLoop_runner (https://cdn.slashkey.com/flash/farm/...js.gz:3:174388)
2022-01-07 15:45:35.532 ERROR{"isTrusted":true}
2022-01-07 15:45:36.255 ERRORAn abnormal situation has occurred: the PlayerLoop internal function has been called recursively. Please contact Customer Support with a sample project so that we can reproduce the problem and troubleshoot it.
2022-01-07 15:45:37.254 ERRORAn abnormal situation has occurred: the PlayerLoop internal function has been called recursively. Please contact Customer Support with a sample project so that we can reproduce the problem and troubleshoot it.
2022-01-07 15:45:38.355 ERRORAn abnormal situation has occurred: the PlayerLoop internal function has been called recursively. Please contact Customer Support with a sample project so that we can reproduce the problem and troubleshoot it.
2022-01-07 15:45:40.252 ERRORAn abnormal situation has occurred: the PlayerLoop internal function has been called recursively. Please contact Customer Support with a sample project so that we can reproduce the problem and troubleshoot it.
2022-01-07 15:45:41.252 ERRORAn abnormal situation has occurred: the PlayerLoop internal function has been called recursively. Please contact Customer Support with a sample project so that we can reproduce the problem and troubleshoot it.
2022-01-07 15:45:42.253 ERRORAn abnormal situation has occurred: the PlayerLoop internal function has been called recursively. Please contact Customer Support with a sample project so that we can reproduce the problem and troubleshoot it.
2022-01-07 15:45:43.255 ERRORAn abnormal situation has occurred: the PlayerLoop internal function has been called recursively. Please contact Customer Support with a sample project so that we can reproduce the problem and troubleshoot it.
2022-01-07 15:45:44.253 ERRORAn abnormal situation has occurred: the PlayerLoop internal function has been called recursively. Please contact Customer Support with a sample project so that we can reproduce the problem and troubleshoot it.
2022-01-07 15:45:45.252 ERRORAn abnormal situation has occurred: the PlayerLoop internal function has been called recursively. Please contact Customer Support with a sample project so that we can reproduce the problem and troubleshoot it.
2022-01-07 15:45:46.252 ERRORAn abnormal situation has occurred: the PlayerLoop internal function has been called recursively. Please contact Customer Support with a sample project so that we can reproduce the problem and troubleshoot it.
2022-01-07 15:45:47.252 ERRORAn abnormal situation has occurred: the PlayerLoop internal function has been called recursively. Please contact Customer Support with a sample project so that we can reproduce the problem and troubleshoot it.
2022-01-07 15:45:48.253 ERRORAn abnormal situation has occurred: the PlayerLoop internal function has been called recursively. Please contact Customer Support with a sample project so that we can reproduce the problem and troubleshoot it.
2022-01-07 15:45:49.260 ERRORAn abnormal situation has occurred: the PlayerLoop internal function has been called recursively. Please contact Customer Support with a sample project so that we can reproduce the problem and troubleshoot it.
2022-01-07 15:45:50.252 ERRORAn abnormal situation has occurred: the PlayerLoop internal function has been called recursively. Please contact Customer Support with a sample project so that we can reproduce the problem and troubleshoot it.
2022-01-07 15:45:51.253 ERRORAn abnormal situation has occurred: the PlayerLoop internal function has been called recursively. Please contact Customer Support with a sample project so that we can reproduce the problem and troubleshoot it.
2022-01-07 15:45:52.253 ERRORAn abnormal situation has occurred: the PlayerLoop internal function has been called recursively. Please contact Customer Support with a sample project so that we can reproduce the problem and troubleshoot it.
2022-01-07 15:45:53.253 ERRORAn abnormal situation has occurred: the PlayerLoop internal function has been called recursively. Please contact Customer Support with a sample project so that we can reproduce the problem and troubleshoot it.
2022-01-07 15:45:54.252 ERRORAn abnormal situation has occurred: the PlayerLoop internal function has been called recursively. Please contact Customer Support with a sample project so that we can reproduce the problem and troubleshoot it.
2022-01-07 15:45:55.253 ERRORAn abnormal situation has occurred: the PlayerLoop internal function has been called recursively. Please contact Customer Support with a sample project so that we can reproduce the problem and troubleshoot it.
2022-01-07 15:45:56.253 ERRORAn abnormal situation has occurred: the PlayerLoop internal function has been called recursively. Please contact Customer Support with a sample project so that we can reproduce the problem and troubleshoot it.
2022-01-07 15:45:57.253 ERRORAn abnormal situation has occurred: the PlayerLoop internal function has been called recursively. Please contact Customer Support with a sample project so that we can reproduce the problem and troubleshoot it.
2022-01-07 15:45:58.253 ERRORAn abnormal situation has occurred: the PlayerLoop internal function has been called recursively. Please contact Customer Support with a sample project so that we can reproduce the problem and troubleshoot it.
2022-01-07 15:45:59.253 ERRORAn abnormal situation has occurred: the PlayerLoop internal function has been called recursively. Please contact Customer Support with a sample project so that we can reproduce the problem and troubleshoot it.
2022-01-07 15:46:01.149 ERRORAn abnormal situation has occurred: the PlayerLoop internal function has been called recursively. Please contact Customer Support with a sample project so that we can reproduce the problem and troubleshoot it.
2022-01-07 15:46:02.148 ERRORAn abnormal situation has occurred: the PlayerLoop internal function has been called recursively. Please contact Customer Support with a sample project so that we can reproduce the problem and troubleshoot it.
2022-01-07 15:46:03.152 ERRORAn abnormal situation has occurred: the PlayerLoop internal function has been called recursively. Please contact Customer Support with a sample project so that we can reproduce the problem and troubleshoot it.
2022-01-07 15:46:04.160 ERRORAn abnormal situation has occurred: the PlayerLoop internal function has been called recursively. Please contact Customer Support with a sample project so that we can reproduce the problem and troubleshoot it.
2022-01-07 15:46:05.148 ERRORAn abnormal situation has occurred: the PlayerLoop internal function has been called recursively. Please contact Customer Support with a sample project so that we can reproduce the problem and troubleshoot it.
2022-01-07 15:46:06.152 ERRORAn abnormal situation has occurred: the PlayerLoop internal function has been called recursively. Please contact Customer Support with a sample project so that we can reproduce the problem and troubleshoot it.
2022-01-07 15:46:07.148 ERRORAn abnormal situation has occurred: the PlayerLoop internal function has been called recursively. Please contact Customer Support with a sample project so that we can reproduce the problem and troubleshoot it.
2022-01-07 15:46:08.148 ERRORAn abnormal situation has occurred: the PlayerLoop internal function has been called recursively. Please contact Customer Support with a sample project so that we can reproduce the problem and troubleshoot it.
2022-01-07 15:46:09.149 ERRORAn abnormal situation has occurred: the PlayerLoop internal function has been called recursively. Please contact Customer Support with a sample project so that we can reproduce the problem and troubleshoot it.
2022-01-07 15:46:10.149 ERRORAn abnormal situation has occurred: the PlayerLoop internal function has been called recursively. Please contact Customer Support with a sample project so that we can reproduce the problem and troubleshoot it.
2022-01-07 15:46:11.149 ERRORAn abnormal situation has occurred: the PlayerLoop internal function has been called recursively. Please contact Customer Support with a sample project so that we can reproduce the problem and troubleshoot it.
2022-01-07 15:46:12.159 ERRORAn abnormal situation has occurred: the PlayerLoop internal function has been called recursively. Please contact Customer Support with a sample project so that we can reproduce the problem and troubleshoot it.
2022-01-07 15:46:13.148 ERRORAn abnormal situation has occurred: the PlayerLoop internal function has been called recursively. Please contact Customer Support with a sample project so that we can reproduce the problem and troubleshoot it.
2022-01-07 15:46:14.148 ERRORAn abnormal situation has occurred: the PlayerLoop internal function has been called recursively. Please contact Customer Support with a sample project so that we can reproduce the problem and troubleshoot it.
2022-01-07 15:46:15.148 ERRORAn abnormal situation has occurred: the PlayerLoop internal function has been called recursively. Please contact Customer Support with a sample project so that we can reproduce the problem and troubleshoot it.
2022-01-07 15:46:16.148 ERRORAn abnormal situation has occurred: the PlayerLoop internal function has been called recursively. Please contact Customer Support with a sample project so that we can reproduce the problem and troubleshoot it.
2022-01-07 15:46:17.148 ERRORAn abnormal situation has occurred: the PlayerLoop internal function has been called recursively. Please contact Customer Support with a sample project so that we can reproduce the problem and troubleshoot it.
2022-01-07 15:46:18.148 ERRORAn abnormal situation has occurred: the PlayerLoop internal function has been called recursively. Please contact Customer Support with a sample project so that we can reproduce the problem and troubleshoot it.
2022-01-07 15:46:19.152 ERRORAn abnormal situation has occurred: the PlayerLoop internal function has been called recursively. Please contact Customer Support with a sample project so that we can reproduce the problem and troubleshoot it.
2022-01-07 15:46:20.252 ERRORAn abnormal situation has occurred: the PlayerLoop internal function has been called recursively. Please contact Customer Support with a sample project so that we can reproduce the problem and troubleshoot it.
2022-01-07 15:46:21.253 ERRORAn abnormal situation has occurred: the PlayerLoop internal function has been called recursively. Please contact Customer Support with a sample project so that we can reproduce the problem and troubleshoot it.
2022-01-07 15:46:22.252 ERRORAn abnormal situation has occurred: the PlayerLoop internal function has been called recursively. Please contact Customer Support with a sample project so that we can reproduce the problem and troubleshoot it.
2022-01-07 15:46:23.252 ERRORAn abnormal situation has occurred: the PlayerLoop internal function has been called recursively. Please contact Customer Support with a sample project so that we can reproduce the problem and troubleshoot it.
2022-01-07 15:46:24.253 ERRORAn abnormal situation has occurred: the PlayerLoop internal function has been called recursively. Please contact Customer Support with a sample project so that we can reproduce the problem and troubleshoot it.
2022-01-07 15:46:25.252 ERRORAn abnormal situation has occurred: the PlayerLoop internal function has been called recursively. Please contact Customer Support with a sample project so that we can reproduce the problem and troubleshoot it.
2022-01-07 15:46:26.252 ERRORAn abnormal situation has occurred: the PlayerLoop internal function has been called recursively. Please contact Customer Support with a sample project so that we can reproduce the problem and troubleshoot it.
2022-01-07 15:46:27.253 ERRORAn abnormal situation has occurred: the PlayerLoop internal function has been called recursively. Please contact Customer Support with a sample project so that we can reproduce the problem and troubleshoot it.
2022-01-07 15:46:28.253 ERRORAn abnormal situation has occurred: the PlayerLoop internal function has been called recursively. Please contact Customer Support with a sample project so that we can reproduce the problem and troubleshoot it.
2022-01-07 15:46:29.252 ERRORAn abnormal situation has occurred: the PlayerLoop internal function has been called recursively. Please contact Customer Support with a sample project so that we can reproduce the problem and troubleshoot it.
2022-01-07 15:46:30.252 ERRORAn abnormal situation has occurred: the PlayerLoop internal function has been called recursively. Please contact Customer Support with a sample project so that we can reproduce the problem and troubleshoot it.
2022-01-07 15:46:31.253 ERRORAn abnormal situation has occurred: the PlayerLoop internal function has been called recursively. Please contact Customer Support with a sample project so that we can reproduce the problem and troubleshoot it.
2022-01-07 15:46:33.149 ERRORAn abnormal situation has occurred: the PlayerLoop internal function has been called recursively. Please contact Customer Support with a sample project so that we can reproduce the problem and troubleshoot it.
2022-01-07 15:46:34.253 ERRORAn abnormal situation has occurred: the PlayerLoop internal function has been called recursively. Please contact Customer Support with a sample project so that we can reproduce the problem and troubleshoot it.
2022-01-07 15:46:35.253 ERRORAn abnormal situation has occurred: the PlayerLoop internal function has been called recursively. Please contact Customer Support with a sample project so that we can reproduce the problem and troubleshoot it.
2022-01-07 15:46:36.253 ERRORAn abnormal situation has occurred: the PlayerLoop internal function has been called recursively. Please contact Customer Support with a sample project so that we can reproduce the problem and troubleshoot it.
2022-01-07 15:46:37.277 ERRORAn abnormal situation has occurred: the PlayerLoop internal function has been called recursively. Please contact Customer Support with a sample project so that we can reproduce the problem and troubleshoot it.
2022-01-07 15:46:38.252 ERRORAn abnormal situation has occurred: the PlayerLoop internal function has been called recursively. Please contact Customer Support with a sample project so that we can reproduce the problem and troubleshoot it.
2022-01-07 15:46:39.253 ERRORAn abnormal situation has occurred: the PlayerLoop internal function has been called recursively. Please contact Customer Support with a sample project so that we can reproduce the problem and troubleshoot it.

getting this when trying to work as SN Farm doesn't matter what i click fine on my own farm i have tried closing clearing mem and updated browser on opera GX and google chrome and still the same message? any ideas?
  #266  
Old Jan 18 2022, 02:48 AM
KoalaBear777 KoalaBear777 is offline
 
Join Date: Aug 18 2019
Posts: 10
Default

I have a train with a cattle car, however, it is not bringing me any animals. When I go to the Train Manager, the car is there but if I open it, it doesn't show me the animals. It just shows me a grayed out puzzle piece thing. What do I do to fix it?

Mod Edit: Animals not displaying when clicking on the question mark for the Long Cattle Car reproduced.
Attached Images
File Type: jpg Capture.JPG (29.3 KB, 1 views)
File Type: jpg Capture2.JPG (88.1 KB, 0 views)

Last edited by Tiger; Jan 18 2022 at 05:56 AM.
  #267  
Old Jan 19 2022, 09:51 PM
Sylentiger's Avatar
Sylentiger Sylentiger is offline
 
Join Date: Mar 14 2010
Location: Jasper, FL, 4 Miles across the Georgia/Florida line
Posts: 26
Send a message via Skype™ to Sylentiger
Default Is this a BUG?

USER ID number ( 1847410380 )

A BUG?
I'm having an issue with the game loading when I'm loading from the
Facility Wall Request page.
I click on a neighbors farm to work and the
The page loads but only to the header page, the game farm does not load. I have to hit reload to engage the game.

This action also happens when I get gifts, the page will not but not the acknowledgment page. when I click reload it shows the gift has been expired (accepted).
???
is it me or a bug
  #268  
Old Jan 22 2022, 07:44 PM
MikeYoung55 MikeYoung55 is offline
 
Join Date: Jul 21 2016
Location: Lisarow, NSW, Australia
Posts: 46
Default Error when selling via Trading Warehouse

When I'm in the market I click on one of the avatars showing beige bar to see their Trading Warehouse. Once there, I try to sell them a product they are asking for in their warehouse. On two occasions the sale appeared to fail (long delay and no confirmation message). Saw the following errors in the console log:
2022-01-23 01:35:47.415 WARNEXCEPTION: Ajax.Notify_Caller - Exception: System.NullReferenceException: Object reference not set to an instance of an object.
2022-01-23 01:36:29.306 WARNEXCEPTION: Ajax.Notify_Caller - Exception: System.NullReferenceException: Object reference not set to an instance of an object.
Happened on two different player warehouses.
__________________
Mike
User: 1278858024
  #269  
Old Jan 27 2022, 08:39 AM
JohnAlbertini JohnAlbertini is offline
 
Join Date: Oct 08 2010
Posts: 495
Default

I have a neighbor USER ID number ( 110421664795463 ) who did not have the Fancy Food Show until buying it for the NCC. However it is not showing up in the NCC?! Click on the icon and it opens the farms grid but none are highlighted despite the facility being on farm 23? If is loadable on the farm but does not show in the NCC?
  #270  
Old Jan 29 2022, 07:55 PM
JohnAlbertini JohnAlbertini is offline
 
Join Date: Oct 08 2010
Posts: 495
Default

2022-01-30 01:49:13.001 ERRORwasm streaming compile failed: TypeError: Could not download wasm module
2022-01-30 01:49:13.002 WARNWebAssembly streaming compilation failed! This can happen for example if "Content-Encoding" HTTP header is incorrectly enabled on the server for file https://cdn.slashkey.com/flash/farm/...ild300.wasm.gz, but the file is not pre-compressed on disk (or vice versa). Check the Network tab in browser Devtools to debug server header configuration.
2022-01-30 01:49:13.003 ERRORfalling back to ArrayBuffer instantiation
2022-01-30 01:51:53.119 ERRORFailed to download file https://cdn.slashkey.com/flash/farm/...ild300.data.gz
Closed Thread

Thread Tools Search this Thread
Search this Thread:

Advanced Search
Display Modes

Posting Rules
You may not post new threads
You may not post replies
You may not post attachments
You may not edit your posts

BB code is On
Smilies are On
[IMG] code is On
HTML code is Off

Forum Jump


All times are GMT -5. The time now is 08:32 PM.